Reaction Details
TargetP2X purinoceptor 3
LigandBDBM320162
Substrate/Competitorn/a
Meas. Tech.Intracellular Calcium Measurement to Assess Antagonist Activity
IC50 5.00±n/a nM
Citation Davenport, AJBräuer, NFischer, OMRotgeri, ARottmann, ANeagoe, INagel, JGodinho-Coelho, AKlar, J 1,3-thiazol-2-yl substituted benzamides US Patent US10202369 Publication Date 2/12/2019
 
P2X purinoceptor 3
Name:P2X purinoceptor 3
Type:Protein
Mol. Mass.:44292.02
Organism:Homo sapiens (Human)
Description:P56373
Residue:397
BDBM320162
NameBDBM320162
Synonyms:3-[(2-methyltetrahydrofuran-2-yl)methoxy]-5-(5-methyl-1,3-thiazol-2-yl)-N-{(1R)-1-[2-(trifluoromethyl)pyrimidin-5-yl]ethyl}benzamide, as a mixture of two diastereoisomers US10202369, Example 330 | US10472354, Example 332
TypeSmall organic molecule
Emp. Form.C24H25F3N4O3S
Mol. Mass.506.541
SMILESC[C@@H](NC(=O)c1cc(OCC2(C)CCCO2)cc(c1)-c1ncc(C)s1)c1cnc(nc1)C(F)(F)F