Reaction Details
TargetCytochrome P450 2C9
LigandBDBM319995
Substrate/Competitorn/a
Meas. Tech.CYP Inhibition Assay
IC50>20000±n/a nM
Citation Davenport, AJBräuer, NFischer, OMRotgeri, ARottmann, ANeagoe, INagel, JGodinho-Coelho, AKlar, J 1,3-thiazol-2-yl substituted benzamides US Patent US10202369 Publication Date 2/12/2019
 
Cytochrome P450 2C9
Name:Cytochrome P450 2C9
Type:Enzyme
Mol. Mass.:55636.33
Organism:Homo sapiens (Human)
Description:P11712
Residue:490
BDBM319995
NameBDBM319995
Synonyms:3-{[3-hydroxybutan-2-yl]oxy}-5-(5-methyl-1,3-thiazol-2-yl)-N-{(1R)-1-[2-(trifluoromethyl)pyrimidin-5-yl]ethyl}benzamide US10174016, Example 338 US10472354, Example 338
TypeSmall organic molecule
Emp. Form.C22H23F3N4O3S
Mol. Mass.480.503
SMILESCC(O)C(C)Oc1cc(cc(c1)-c1ncc(C)s1)C(=O)N[C@H](C)c1cnc(nc1)C(F)(F)F