Reaction Details
TargetMast/stem cell growth factor receptor Kit
LigandBDBM346014
Substrate/Competitorn/a
Meas. Tech.In Vitro TK Inhibition Assay
EC50<1000±n/a nM
Citation Moussy, ABenjahad, ASchalon, CPez, DChevenier, ESandrinelli, FMartin, JPicoul, W Benzimidazole derivatives as selective proteine kinase inhibitors US Patent US10202370 Publication Date 2/12/2019
 
Mast/stem cell growth factor receptor Kit
Name:Mast/stem cell growth factor receptor Kit
Type:Protein
Mol. Mass.:109869.37
Organism:Homo sapiens (Human)
Description:P10721
Residue:976
BDBM346014
NameBDBM346014
Synonyms:US10202370, Example 003 | {6-Methyl-2-[4-(4- methyl-piperazin-1- ylmethyl)-phenyl]- 3H-benzoimidazol-5- yl}-(4-pyridin-3-yl- thiazol-2-yl)-amine
TypeSmall organic molecule
Emp. Form.C28H29N7S
Mol. Mass.495.642
SMILESCN1CCN(Cc2ccc(cc2)-c2nc3cc(C)c(Nc4nc(cs4)-c4cccnc4)cc3[nH]2)CC1