Reaction Details
TargetMast/stem cell growth factor receptor Kit
LigandBDBM346031
Substrate/Competitorn/a
Meas. Tech.In Vitro TK Inhibition Assay
EC50<1000±n/a nM
Citation Moussy, ABenjahad, ASchalon, CPez, DChevenier, ESandrinelli, FMartin, JPicoul, W Benzimidazole derivatives as selective proteine kinase inhibitors US Patent US10202370 Publication Date 2/12/2019
 
Mast/stem cell growth factor receptor Kit
Name:Mast/stem cell growth factor receptor Kit
Type:Protein
Mol. Mass.:109869.37
Organism:Homo sapiens (Human)
Description:P10721
Residue:976
BDBM346031
NameBDBM346031
Synonyms:US10202370, Example 041 | [6-Methyl-2-(4- methyl-3- trifluoromethyl- phenyl)-3H- benzoimidazol-5-yl]- (4-pyridin-3-yl- pyrimidin-2-yl)- amine
TypeSmall organic molecule
Emp. Form.C25H19F3N6
Mol. Mass.460.4538
SMILESCc1ccc(cc1C(F)(F)F)-c1nc2cc(C)c(Nc3nccc(n3)-c3cccnc3)cc2[nH]1