Reaction Details
TargetMast/stem cell growth factor receptor Kit
LigandBDBM346036
Substrate/Competitorn/a
Meas. Tech.In Vitro TK Inhibition Assay
EC50<1000±n/a nM
Citation Moussy, ABenjahad, ASchalon, CPez, DChevenier, ESandrinelli, FMartin, JPicoul, W Benzimidazole derivatives as selective proteine kinase inhibitors US Patent US10202370 Publication Date 2/12/2019
 
Mast/stem cell growth factor receptor Kit
Name:Mast/stem cell growth factor receptor Kit
Type:Protein
Mol. Mass.:109869.37
Organism:Homo sapiens (Human)
Description:P10721
Residue:976
BDBM346036
NameBDBM346036
Synonyms:US10202370, Example 056 | [6-Methyl-2-(4- methyl-3- trifluoromethyl- phenyl)-3H- benzoimidazol-5-yl]- (4-pyridin-3-yl- thiazol-2-yl)-amine
TypeSmall organic molecule
Emp. Form.C24H18F3N5S
Mol. Mass.465.493
SMILESCc1ccc(cc1C(F)(F)F)-c1nc2cc(C)c(Nc3nc(cs3)-c3cccnc3)cc2[nH]1