Reaction Details
TargetMast/stem cell growth factor receptor Kit
LigandBDBM346044
Substrate/Competitorn/a
Meas. Tech.In Vitro TK Inhibition Assay
EC50<1000±n/a nM
Citation Moussy, ABenjahad, ASchalon, CPez, DChevenier, ESandrinelli, FMartin, JPicoul, W Benzimidazole derivatives as selective proteine kinase inhibitors US Patent US10202370 Publication Date 2/12/2019
 
Mast/stem cell growth factor receptor Kit
Name:Mast/stem cell growth factor receptor Kit
Type:Protein
Mol. Mass.:109869.37
Organism:Homo sapiens (Human)
Description:P10721
Residue:976
BDBM346044
NameBDBM346044
Synonyms:4-{2-[2-(3- Difluoromethyl- phenyl)-6-methyl- 3H-benzoimidazol-5- ylamino]-thiazol-4- yl}-benzamide | US10202370, Example 071
TypeSmall organic molecule
Emp. Form.C25H19F2N5OS
Mol. Mass.475.513
SMILESCc1cc2nc([nH]c2cc1Nc1nc(cs1)-c1ccc(cc1)C(N)=O)-c1cccc(c1)C(F)F