Reaction Details
TargetMast/stem cell growth factor receptor Kit
LigandBDBM346050
Substrate/Competitorn/a
Meas. Tech.In Vitro TK Inhibition Assay
EC50<1000±n/a nM
Citation Moussy, ABenjahad, ASchalon, CPez, DChevenier, ESandrinelli, FMartin, JPicoul, W Benzimidazole derivatives as selective proteine kinase inhibitors US Patent US10202370 Publication Date 2/12/2019
 
Mast/stem cell growth factor receptor Kit
Name:Mast/stem cell growth factor receptor Kit
Type:Protein
Mol. Mass.:109869.37
Organism:Homo sapiens (Human)
Description:P10721
Residue:976
BDBM346050
NameBDBM346050
Synonyms:US10202370, Example 079 | [6-Methyl-2-(5- methyl-thiophen-2- yl)-1H- benzoimidazol-5-yl]- (4-pyridin-4-yl- thiazol-2-yl)-amine
TypeSmall organic molecule
Emp. Form.C21H17N5S2
Mol. Mass.403.523
SMILESCc1ccc(s1)-c1nc2cc(Nc3nc(cs3)-c3ccncc3)c(C)cc2[nH]1