Reaction Details
TargetMast/stem cell growth factor receptor Kit
LigandBDBM346057
Substrate/Competitorn/a
Meas. Tech.In Vitro TK Inhibition Assay
EC50<1000±n/a nM
Citation Moussy, ABenjahad, ASchalon, CPez, DChevenier, ESandrinelli, FMartin, JPicoul, W Benzimidazole derivatives as selective proteine kinase inhibitors US Patent US10202370 Publication Date 2/12/2019
 
Mast/stem cell growth factor receptor Kit
Name:Mast/stem cell growth factor receptor Kit
Type:Protein
Mol. Mass.:109869.37
Organism:Homo sapiens (Human)
Description:P10721
Residue:976
BDBM346057
NameBDBM346057
Synonyms:US10202370, Example 087 | [2-(3-Difluoromethyl- phenyl)-1H- benzoimidazol-5-yl]- (4-pyridin-3-yl- thiazol-2-yl)-amine
TypeSmall organic molecule
Emp. Form.C22H15F2N5S
Mol. Mass.419.45
SMILESFC(F)c1cccc(c1)-c1nc2cc(Nc3nc(cs3)-c3cccnc3)ccc2[nH]1