Reaction Details
TargetPhosphatidylinositol 4,5-bisphosphate 3-kinase catalytic subunit alpha isoform
LigandBDBM346188
Substrate/Competitorn/a
Meas. Tech.Biochemical Assays for PI3Kalpha, PI3Kbeta
IC50 327±n/a nM
Citation Fairhurst, RAFuret, PKalthoff, FSLerchner, ARueeger, H Oxazolidin-2-one-pyrimidine derivatives and the use thereof as phosphatidylinositol-3-kinase inhibitors US Patent US10202371 Publication Date 2/12/2019
 
Phosphatidylinositol 4,5-bisphosphate 3-kinase catalytic subunit alpha isoform
Name:Phosphatidylinositol 4,5-bisphosphate 3-kinase catalytic subunit alpha isoform
Type:Enzyme Subunit
Mol. Mass.:124294.87
Organism:Homo sapiens (Human)
Description:P42336
Residue:1068
BDBM346188
NameBDBM346188
Synonyms:WO2007/084786, Compound 324
TypeSmall organic molecule
Emp. Form.C18H20F3N7O2
Mol. Mass.423.3923
SMILESNc1ncc(-c2cc(nc(n2)N2CCOCC2)N2CCC(=O)CC2)c(n1)C(F)(F)F