Reaction Details
TargetPhosphatidylinositol 4,5-bisphosphate 3-kinase catalytic subunit gamma isoform
LigandBDBM346173
Substrate/Competitorn/a
IC50 110±n/a nM
Citation Fairhurst, RAFuret, PKalthoff, FSLerchner, ARueeger, H Oxazolidin-2-one-pyrimidine derivatives and the use thereof as phosphatidylinositol-3-kinase inhibitors US Patent US10202371 Publication Date 2/12/2019
 
Phosphatidylinositol 4,5-bisphosphate 3-kinase catalytic subunit gamma isoform
Name:Phosphatidylinositol 4,5-bisphosphate 3-kinase catalytic subunit gamma isoform
Type:Enzyme Subunit
Mol. Mass.:126470.30
Organism:Homo sapiens (Human)
Description:P48736
Residue:1102
BDBM346173
NameBDBM346173
Synonyms:US10202371, Example 3
TypeSmall organic molecule
Emp. Form.C24H24F3N7O5
Mol. Mass.547.4865
SMILESCOc1ccc(cc1)[C@@H]1OC(=O)N([C@H]1CO)c1cc(nc(n1)N1CCOCC1)-c1cnc(N)nc1C(F)(F)F