Reaction Details
TargetPhosphatidylinositol 4,5-bisphosphate 3-kinase catalytic subunit gamma isoform
LigandBDBM346184
Substrate/Competitorn/a
IC50 27.0±n/a nM
Citation Fairhurst, RAFuret, PKalthoff, FSLerchner, ARueeger, H Oxazolidin-2-one-pyrimidine derivatives and the use thereof as phosphatidylinositol-3-kinase inhibitors US Patent US10202371 Publication Date 2/12/2019
 
Phosphatidylinositol 4,5-bisphosphate 3-kinase catalytic subunit gamma isoform
Name:Phosphatidylinositol 4,5-bisphosphate 3-kinase catalytic subunit gamma isoform
Type:Enzyme Subunit
Mol. Mass.:126470.30
Organism:Homo sapiens (Human)
Description:P48736
Residue:1102
BDBM346184
NameBDBM346184
Synonyms:US10202371, Example 14
TypeSmall organic molecule
Emp. Form.C26H28F3N7O6
Mol. Mass.591.539
SMILESNc1ncc(-c2cc(nc(n2)N2CCOCC2)N2[C@@H](CO)[C@@H](OC2=O)c2ccc(OCCCO)cc2)c(n1)C(F)(F)F