Reaction Details
TargetPhosphatidylinositol 4,5-bisphosphate 3-kinase catalytic subunit gamma isoform
LigandBDBM346186
Substrate/Competitorn/a
IC50 7350±n/a nM
Citation Fairhurst, RAFuret, PKalthoff, FSLerchner, ARueeger, H Oxazolidin-2-one-pyrimidine derivatives and the use thereof as phosphatidylinositol-3-kinase inhibitors US Patent US10202371 Publication Date 2/12/2019
 
Phosphatidylinositol 4,5-bisphosphate 3-kinase catalytic subunit gamma isoform
Name:Phosphatidylinositol 4,5-bisphosphate 3-kinase catalytic subunit gamma isoform
Type:Enzyme Subunit
Mol. Mass.:126470.30
Organism:Homo sapiens (Human)
Description:P48736
Residue:1102
BDBM346186
NameBDBM346186
Synonyms:WO2007/084786, Compound 18
TypeSmall organic molecule
Emp. Form.C22H21F3N8O2
Mol. Mass.486.4497
SMILESNc1ncc(-c2cc(nc(n2)N2CCOCC2)N2CCN(C2=O)c2ccccc2)c(n1)C(F)(F)F