Reaction Details
TargetSerine/threonine-protein kinase mTOR
LigandBDBM346173
Substrate/Competitorn/a
Meas. Tech.Biochemical Assay for mTOR
IC50 850±n/a nM
Citation Fairhurst, RAFuret, PKalthoff, FSLerchner, ARueeger, H Oxazolidin-2-one-pyrimidine derivatives and the use thereof as phosphatidylinositol-3-kinase inhibitors US Patent US10202371 Publication Date 2/12/2019
 
Serine/threonine-protein kinase mTOR
Name:Serine/threonine-protein kinase mTOR
Type:Rapamycin target protein
Mol. Mass.:288917.12
Organism:Homo sapiens (Human)
Description:P42345
Residue:2549
BDBM346173
NameBDBM346173
Synonyms:US10202371, Example 3
TypeSmall organic molecule
Emp. Form.C24H24F3N7O5
Mol. Mass.547.4865
SMILESCOc1ccc(cc1)[C@@H]1OC(=O)N([C@H]1CO)c1cc(nc(n1)N1CCOCC1)-c1cnc(N)nc1C(F)(F)F