Reaction Details
TargetSerine/threonine-protein kinase mTOR
LigandBDBM50380377
Substrate/Competitorn/a
Meas. Tech.Biochemical Assay for mTOR
IC50 2350±n/a nM
Citation Fairhurst, RAFuret, PKalthoff, FSLerchner, ARueeger, H Oxazolidin-2-one-pyrimidine derivatives and the use thereof as phosphatidylinositol-3-kinase inhibitors US Patent US10202371 Publication Date 2/12/2019
 
Serine/threonine-protein kinase mTOR
Name:Serine/threonine-protein kinase mTOR
Type:Rapamycin target protein
Mol. Mass.:288917.12
Organism:Homo sapiens (Human)
Description:P42345
Residue:2549
BDBM50380377
NameBDBM50380377
Synonyms:CHEMBL2017977 | WO2007/084786, Compound 85
TypeSmall organic molecule
Emp. Form.C17H20F3N7O2
Mol. Mass.411.3816
SMILESNc1ncc(-c2cc(nc(n2)N2CCOCC2)N2CCOCC2)c(n1)C(F)(F)F