Reaction Details
TargetSerine/threonine-protein kinase mTOR
LigandBDBM346188
Substrate/Competitorn/a
Meas. Tech.Biochemical Assay for mTOR
IC50>9550±n/a nM
Citation Fairhurst, RAFuret, PKalthoff, FSLerchner, ARueeger, H Oxazolidin-2-one-pyrimidine derivatives and the use thereof as phosphatidylinositol-3-kinase inhibitors US Patent US10202371 Publication Date 2/12/2019
 
Serine/threonine-protein kinase mTOR
Name:Serine/threonine-protein kinase mTOR
Type:Rapamycin target protein
Mol. Mass.:288917.12
Organism:Homo sapiens (Human)
Description:P42345
Residue:2549
BDBM346188
NameBDBM346188
Synonyms:WO2007/084786, Compound 324
TypeSmall organic molecule
Emp. Form.C18H20F3N7O2
Mol. Mass.423.3923
SMILESNc1ncc(-c2cc(nc(n2)N2CCOCC2)N2CCC(=O)CC2)c(n1)C(F)(F)F