Reaction Details
TargetPhosphatidylinositol 4,5-bisphosphate 3-kinase catalytic subunit alpha isoform
LigandBDBM346185
Substrate/Competitorn/a
Meas. Tech.Cellular Assays for PI3Kalpha, Beta and Delta
IC50 369±n/a nM
Citation Fairhurst, RAFuret, PKalthoff, FSLerchner, ARueeger, H Oxazolidin-2-one-pyrimidine derivatives and the use thereof as phosphatidylinositol-3-kinase inhibitors US Patent US10202371 Publication Date 2/12/2019
 
Phosphatidylinositol 4,5-bisphosphate 3-kinase catalytic subunit alpha isoform
Name:Phosphatidylinositol 4,5-bisphosphate 3-kinase catalytic subunit alpha isoform
Type:Enzyme Catalytic Domain
Mol. Mass.:124363.80
Organism:Rattus norvegicus (Rat)
Description:A0A0G2K344
Residue:1068
BDBM346185
NameBDBM346185
Synonyms:WO2007/084786, Compound 17
TypeSmall organic molecule
Emp. Form.C18H20F3N7O2
Mol. Mass.423.3923
SMILESNc1ncc(-c2cc(nc(n2)N2CCOCC2)N2CCCCC2=O)c(n1)C(F)(F)F