Reaction Details
TargetcAMP-specific 3',5'-cyclic phosphodiesterase 4B [316-320,321-700,S319G,N320S,N321H,T322M]
LigandBDBM14782
Substrate/CompetitorBDBM10851
Meas. Tech.Phosphodiesterase (PDE) Inhibition Assay
pH7.5±n/a
Temperature303.15±n/a K
IC50>200000±n/a nM
Citation Card, GLBlasdel, LEngland, BPZhang, CSuzuki, YGillette, SFong, DIbrahim, PNArtis, DRBollag, GMilburn, MVKim, SHSchlessinger, JZhang, KY A family of phosphodiesterase inhibitors discovered by cocrystallography and scaffold-based drug design. Nat Biotechnol23:201-7 (2005) 
 
cAMP-specific 3',5'-cyclic phosphodiesterase 4B [316-320,321-700,S319G,N320S,N321H,T322M]
Name:cAMP-specific 3',5'-cyclic phosphodiesterase 4B [316-320,321-700,S319G,N320S,N321H,T322M]
Type:Enzyme Catalytic Domain
Mol. Mass.:45579.64
Organism:Homo sapiens (Human)
Description:RECOMBINANT CATALYTIC DOMAIN OF HUMAN PHOSPHODIESTERASE 4B.
Residue:398
BDBM14782
BDBM10851
NameBDBM14782
Synonyms:5-(trifluoromethyl)-1H-pyrazole-4-carboxylic acid ethyl ester ethyl 3-(trifluoromethyl)-1H-pyrazole-4-carboxylate
TypeSmall organic molecule
Emp. Form.C7H7F3N2O2
Mol. Mass.208.1379
SMILESCCOC(=O)c1cn[nH]c1C(F)(F)F