Reaction Details
TargetcAMP-specific 3',5'-cyclic phosphodiesterase 4D [372-376,381-715,S375G,I381V,S383G,G384S,V385H,K386M)
LigandBDBM14790
Substrate/CompetitorBDBM10851
Meas. Tech.Phosphodiesterase (PDE) Inhibition Assay
IC50 4600±n/a nM
Citation Card, GLBlasdel, LEngland, BPZhang, CSuzuki, YGillette, SFong, DIbrahim, PNArtis, DRBollag, GMilburn, MVKim, SHSchlessinger, JZhang, KY A family of phosphodiesterase inhibitors discovered by cocrystallography and scaffold-based drug design. Nat Biotechnol23:201-7 (2005) 
 
cAMP-specific 3',5'-cyclic phosphodiesterase 4D [372-376,381-715,S375G,I381V,S383G,G384S,V385H,K386M)
Name:cAMP-specific 3',5'-cyclic phosphodiesterase 4D [372-376,381-715,S375G,I381V,S383G,G384S,V385H,K386M)
Type:Enzyme Catalytic Domain
Mol. Mass.:40034.37
Organism:Homo sapiens (Human)
Description:RECOMBINANT CATALYTIC DOMAIN OF HUMAN PHOSPHODIESTERASE 4D.
Residue:349
BDBM14790
BDBM10851
NameBDBM14790
Synonyms:Pyrazole carboxylic ester 13 | ethyl 1-(2,4-dinitrophenyl)-3,5-dimethyl-1H-pyrazole-4-carboxylate
TypeSmall organic molecule
Emp. Form.C14H14N4O6
Mol. Mass.334.2842
SMILESCCOC(=O)c1c(C)nn(c1C)-c1ccc(cc1[N+]([O-])=O)[N+]([O-])=O