Reaction Details
TargetProtein Wnt-3a
LigandBDBM346242
Substrate/Competitorn/a
Meas. Tech.Dual-Cell beta-Catenin Reporter Assay
IC50<1±n/a nM
Citation Bhamra, IMathieson, MDonoghue, CTestar, R N-pyridinyl acetamide derivatives as Wnt signalling pathway inhibitors US Patent US10202375 Publication Date 2/12/2019
 
Protein Wnt-3a
Name:Protein Wnt-3a
Type:PROTEIN
Mol. Mass.:39269.29
Organism:Mus musculus
Description:ChEMBL_813156
Residue:352
BDBM346242
NameBDBM346242
Synonyms:2-[5-(2-methyl-4-pyridyl)pyrrolo[2,3-b]pyridin-1-yl]-N-(5-pyrazin-2-yl-2-pyridyl)acetamide US10202375, Example 5
TypeSmall organic molecule
Emp. Form.C24H19N7O
Mol. Mass.421.454
SMILESCc1cc(ccn1)-c1ccnc2n(CC(=O)Nc3ccc(nc3)-c3cnccn3)ccc12