Reaction Details
TargetProtein Wnt-3a
LigandBDBM346252
Substrate/Competitorn/a
Meas. Tech.Dual-Cell beta-Catenin Reporter Assay
IC50 3±n/a nM
Citation Bhamra, IMathieson, MDonoghue, CTestar, R N-pyridinyl acetamide derivatives as Wnt signalling pathway inhibitors US Patent US10202375 Publication Date 2/12/2019
 
Protein Wnt-3a
Name:Protein Wnt-3a
Type:PROTEIN
Mol. Mass.:39269.29
Organism:Mus musculus
Description:ChEMBL_813156
Residue:352
BDBM346252
NameBDBM346252
Synonyms:2-[4-(2-methyl-4-pyridyl)pyrazolo[3,4-b]pyridin-1-yl]-N-(6-pyrazin-2-yl-3-pyridyl)acetamide | US10202375, Example 15
TypeSmall organic molecule
Emp. Form.C23H18N8O
Mol. Mass.422.442
SMILESCc1cc(ccn1)-c1ccnc2n(CC(=O)Nc3ccc(nc3)-c3cnccn3)ncc12