Reaction Details
TargetProtein Wnt-3a
LigandBDBM346257
Substrate/Competitorn/a
Meas. Tech.Dual-Cell beta-Catenin Reporter Assay
IC50 3±n/a nM
Citation Bhamra, IMathieson, MDonoghue, CTestar, R N-pyridinyl acetamide derivatives as Wnt signalling pathway inhibitors US Patent US10202375 Publication Date 2/12/2019
 
Protein Wnt-3a
Name:Protein Wnt-3a
Type:PROTEIN
Mol. Mass.:39269.29
Organism:Mus musculus
Description:ChEMBL_813156
Residue:352
BDBM346257
NameBDBM346257
Synonyms:2-[4-(2-methyl-4-pyridyl)imidazo[4,5-c]pyridin-1-yl]-N-(5-pyrazin-2-yl-2-pyridyl)acetamide | US10202375, Example 20
TypeSmall organic molecule
Emp. Form.C23H18N8O
Mol. Mass.422.442
SMILESCc1cc(ccn1)-c1nccc2n(CC(=O)Nc3ccc(cn3)-c3cnccn3)cnc12