Reaction Details
TargetMitogen-activated protein kinase 14
LigandBDBM13533
Substrate/CompetitorBDBM14832
Meas. Tech.Fluorescence Exchange Curve Assay
pH7±n/a
Temperature296.15±n/a K
Kd 0.1±n/a nM
CommentsKd was determined and calculated as koff/kon.
Citation Pargellis, CTong, LChurchill, LCirillo, PFGilmore, TGraham, AGGrob, PMHickey, ERMoss, NPav, SRegan, J Inhibition of p38 MAP kinase by utilizing a novel allosteric binding site. Nat Struct Biol9:268-72 (2002) 
 
Mitogen-activated protein kinase 14
Name:Mitogen-activated protein kinase 14
Type:Serine/threonine-protein kinase
Mol. Mass.:41286.76
Organism:Homo sapiens (Human)
Description:Q16539
Residue:360
BDBM13533
BDBM14832
NameBDBM13533
Synonyms:1-[2-(4-methylphenyl)-5-tert-butyl-pyrazol-3-yl]-3-[4-(2-morpholin-4-ylethoxy)naphthalen-1-yl]urea 1-[5-tert-butyl-2-(4-methylphenyl)pyrazol-3-yl]-3-[4-(2-morpholin-4-ylethoxy)naphthalen-1-yl]urea 3-[2-(4-methylphenyl)-5-tert-butyl-pyrazol-3-yl]-1-[4-(2-morpholin-4-ylethoxy)naphthalen-1-yl]urea BIRB 796 BIRB-796, 3 D3RKN_73 US11407771, Compound 43 US9187470, 43 (BIRB-796) US9260410, BIRB796 diaryl urea compound 10
TypeSmall organic molecule
Emp. Form.C31H37N5O3
Mol. Mass.527.6572
SMILESCc1ccc(cc1)-n1nc(cc1NC(=O)Nc1ccc(OCCN2CCOCC2)c2ccccc12)C(C)(C)C