Reaction Details
TargetTGF-beta receptor type-1
LigandBDBM346298
Substrate/Competitorn/a
Meas. Tech.TGF-beta 1 Assay
EC50 9.00±n/a nM
Citation KC, SKWallace, DMCao, JChiruta, CHood, J 3-(1H-benzo[D]imidazol-2-yl)-1H-pyrazolo[3,4-C]pyridine and therapeutic uses thereof US Patent US10202377 Publication Date 2/12/2019
 
TGF-beta receptor type-1
Name:TGF-beta receptor type-1
Type:enzyme
Mol. Mass.:55968.24
Organism:Homo sapiens (Human)
Description:P36897
Residue:503
BDBM346298
NameBDBM346298
Synonyms:US10202377, Compound 181
TypeSmall organic molecule
Emp. Form.C28H28F2N8
Mol. Mass.514.5723
SMILESFC1(F)CCN(Cc2cncc(c2)-c2cc3c(n[nH]c3cn2)-c2nc3c(cccc3[nH]2)N2CCCCC2)C1