Reaction Details
TargetTGF-beta receptor type-1
LigandBDBM346313
Substrate/Competitorn/a
Meas. Tech.TGF-beta 1 Assay
EC50 9.00±n/a nM
Citation KC, SKWallace, DMCao, JChiruta, CHood, J 3-(1H-benzo[D]imidazol-2-yl)-1H-pyrazolo[3,4-C]pyridine and therapeutic uses thereof US Patent US10202377 Publication Date 2/12/2019
 
TGF-beta receptor type-1
Name:TGF-beta receptor type-1
Type:enzyme
Mol. Mass.:55968.24
Organism:Homo sapiens (Human)
Description:P36897
Residue:503
BDBM346313
NameBDBM346313
Synonyms:US10202377, Compound 265
TypeSmall organic molecule
Emp. Form.C23H16N6S
Mol. Mass.408.478
SMILESCc1ccncc1-c1cc2c(n[nH]c2cn1)-c1nc2c(cccc2[nH]1)-c1ccsc1