Reaction Details
TargetTGF-beta receptor type-1
LigandBDBM346379
Substrate/Competitorn/a
Meas. Tech.TGF-beta 1 Assay
EC50 9.00±n/a nM
Citation KC, SKWallace, DMCao, JChiruta, CHood, J 3-(1H-benzo[D]imidazol-2-yl)-1H-pyrazolo[3,4-C]pyridine and therapeutic uses thereof US Patent US10202377 Publication Date 2/12/2019
 
TGF-beta receptor type-1
Name:TGF-beta receptor type-1
Type:enzyme
Mol. Mass.:55968.24
Organism:Homo sapiens (Human)
Description:P36897
Residue:503
BDBM346379
NameBDBM346379
Synonyms:US10202377, Compound 953
TypeSmall organic molecule
Emp. Form.C24H15FN6
Mol. Mass.406.4145
SMILESFc1cccc(c1)-c1cccc2[nH]c(nc12)-c1n[nH]c2cnc(cc12)-c1ccccn1