Reaction Details
TargetTyrosine-protein kinase BTK
LigandBDBM205082
Substrate/Competitorn/a
Meas. Tech.Bruton's Tyrosine Kinase (BTK) Inhibition Assay
pH7.2±n/a
IC50 0.920±0 nM
Commentsextracted
Citation Brotherton-Pleiss, CEKondru, RKLopez-Tapia, FJLou, Y Inhibitors of bruton's tyrosine kinase US Patent US9556147 Publication Date 1/31/2017
 
Tyrosine-protein kinase BTK
Name:Tyrosine-protein kinase BTK
Type:Enzyme
Mol. Mass.:76289.95
Organism:Homo sapiens (Human)
Description:Q06187
Residue:659
BDBM205082
NameBDBM205082
Synonyms:US9556147, 1
TypeSmall organic molecule
Emp. Form.C37H37FN6O5
Mol. Mass.664.7253
SMILESCn1c2CC(O)Cc3c(cccc3-n3ncc4cc(cc(F)c4c3=O)C(C)(C)C)-c2cc(Nc2ccc(cn2)C(=O)N2CCOCC2)c1=O