Reaction Details
TargetTranscription initiation factor TFIID subunit 1
LigandBDBM346702
Substrate/Competitorn/a
Meas. Tech.CPE Inhibitory Effect Confirming Assay
IC50 18.0±n/a nM
Citation Takahashi, CMikamiyama, HAkiyama, TTomita, KTaoda, YKawai, MAnan, KMiyagawa, M Substituted polycyclic carbamoyl pyridone derivative prodrug US Patent US10202379 Publication Date 2/12/2019
 
Transcription initiation factor TFIID subunit 1
Name:Transcription initiation factor TFIID subunit 1
Type:PROTEIN
Mol. Mass.:212598.75
Organism:Homo sapiens (Human)
Description:ChEMBL_108248
Residue:1872
BDBM346702
NameBDBM346702
Synonyms:US10202379, Reference Example 304
TypeSmall organic molecule
Emp. Form.C23H20FN3O3S
Mol. Mass.437.487
SMILESOc1c2C(=O)N(CCF)CN(C3c4ccccc4CSc4ccccc34)n2ccc1=O