Reaction Details
TargetTranscription initiation factor TFIID subunit 1
LigandBDBM346744
Substrate/Competitorn/a
Meas. Tech.CPE Inhibitory Effect Confirming Assay
IC50 14.0±n/a nM
Citation Takahashi, CMikamiyama, HAkiyama, TTomita, KTaoda, YKawai, MAnan, KMiyagawa, M Substituted polycyclic carbamoyl pyridone derivative prodrug US Patent US10202379 Publication Date 2/12/2019
 
Transcription initiation factor TFIID subunit 1
Name:Transcription initiation factor TFIID subunit 1
Type:PROTEIN
Mol. Mass.:212598.75
Organism:Homo sapiens (Human)
Description:ChEMBL_108248
Residue:1872
BDBM346744
NameBDBM346744
Synonyms:US10202379, Reference Example 347
TypeSmall organic molecule
Emp. Form.C22H18ClN3O3S
Mol. Mass.439.915
SMILESCN1CN(C2c3ccccc3CSc3c(Cl)cccc23)n2ccc(=O)c(O)c2C1=O