Reaction Details
TargetTranscription initiation factor TFIID subunit 1
LigandBDBM346975
Substrate/Competitorn/a
Meas. Tech.CPE Inhibitory Effect Confirming Assay
IC50 20.6±n/a nM
Citation Takahashi, CMikamiyama, HAkiyama, TTomita, KTaoda, YKawai, MAnan, KMiyagawa, M Substituted polycyclic carbamoyl pyridone derivative prodrug US Patent US10202379 Publication Date 2/12/2019
 
Transcription initiation factor TFIID subunit 1
Name:Transcription initiation factor TFIID subunit 1
Type:PROTEIN
Mol. Mass.:212598.75
Organism:Homo sapiens (Human)
Description:ChEMBL_108248
Residue:1872
BDBM346975
NameBDBM346975
Synonyms:US10202379, Reference Example 710
TypeSmall organic molecule
Emp. Form.C26H23ClF3N3O4S
Mol. Mass.565.992
SMILESCC(O)c1cn2N(CN([C@H](C)C(F)(F)F)C(=O)c2c(O)c1=O)[C@@H]1c2ccccc2SCc2cccc(Cl)c12