Reaction Details
TargetTranscription initiation factor TFIID subunit 1
LigandBDBM346984
Substrate/Competitorn/a
Meas. Tech.CPE Inhibitory Effect Confirming Assay
IC50 3.74±n/a nM
Citation Takahashi, CMikamiyama, HAkiyama, TTomita, KTaoda, YKawai, MAnan, KMiyagawa, M Substituted polycyclic carbamoyl pyridone derivative prodrug US Patent US10202379 Publication Date 2/12/2019
 
Transcription initiation factor TFIID subunit 1
Name:Transcription initiation factor TFIID subunit 1
Type:PROTEIN
Mol. Mass.:212598.75
Organism:Homo sapiens (Human)
Description:ChEMBL_108248
Residue:1872
BDBM346984
NameBDBM346984
Synonyms:US10202379, Reference Example 726
TypeSmall organic molecule
Emp. Form.C26H19F4N3O3S
Mol. Mass.529.506
SMILESC[C@@H](N1CN([C@@H]2c3cccc(F)c3SCc3cccc(C#C)c23)n2ccc(=O)c(O)c2C1=O)C(F)(F)F