Reaction Details
TargetUbiquitin-like modifier-activating enzyme 1
LigandBDBM329901
Substrate/Competitorn/a
Meas. Tech.Ubiquitin Activating Enzyme (UAE) HTRF Assay
IC50<10±n/a nM
Citation Afroze, RBharathan, ITCiavarri, JPFleming, PEGaulin, JLGirard, MLangston, SPSoucy, FWong, TYe, Y Pyrazolopyrimidinyl inhibitors of ubiquitin-activating enzyme US Patent US10202389 Publication Date 2/12/2019
 
Ubiquitin-like modifier-activating enzyme 1
Name:Ubiquitin-like modifier-activating enzyme 1
Type:PROTEIN
Mol. Mass.:117834.03
Organism:Homo sapiens (Human)
Description:ChEMBL_827630
Residue:1058
BDBM329901
NameBDBM329901
Synonyms:(s.e.)-((1R,2R,3S,4R)-2,3-dihydroxy-4-(2-(2-isopropoxynaphthalen-1- US9663525, Compound I-109
TypeSmall organic molecule
Emp. Form.C25H29N5O6S
Mol. Mass.527.593
SMILESCC(C)Oc1ccc2ccccc2c1-c1cc2nccc(N[C@@H]3C[C@H](COS(N)(=O)=O)[C@@H](O)[C@H]3O)n2n1