Reaction Details
TargetG protein-activated inward rectifier potassium channel 4
LigandBDBM347051
Substrate/Competitorn/a
Meas. Tech.TBD
IC50 18.0±n/a nM
Citation Duncia, JVGardner, DSHynes, JMacor, JENair, SKPaidi, VRSantella, JBSarkunam, KSistla, RKPolimera, SRWu, H Heteroaryl substituted aminopyridine compounds US Patent US10202390 Publication Date 2/12/2019
 
G protein-activated inward rectifier potassium channel 4
Name:G protein-activated inward rectifier potassium channel 4
Type:PROTEIN
Mol. Mass.:47658.06
Organism:Homo sapiens (Human)
Description:ChEMBL_107914
Residue:419
BDBM347051
NameBDBM347051
Synonyms:US10202390, Example 6
TypeSmall organic molecule
Emp. Form.C21H22N8
Mol. Mass.386.453
SMILESCCCn1cc(cn1)-c1cnc(cc1NC(C)C)-c1cnc2cc(cnn12)C#N