Reaction Details
TargetG protein-activated inward rectifier potassium channel 4
LigandBDBM347055
Substrate/Competitorn/a
Meas. Tech.TBD
IC50 20.0±n/a nM
Citation Duncia, JVGardner, DSHynes, JMacor, JENair, SKPaidi, VRSantella, JBSarkunam, KSistla, RKPolimera, SRWu, H Heteroaryl substituted aminopyridine compounds US Patent US10202390 Publication Date 2/12/2019
 
G protein-activated inward rectifier potassium channel 4
Name:G protein-activated inward rectifier potassium channel 4
Type:PROTEIN
Mol. Mass.:47658.06
Organism:Homo sapiens (Human)
Description:ChEMBL_107914
Residue:419
BDBM347055
NameBDBM347055
Synonyms:US10202390, Example 10
TypeSmall organic molecule
Emp. Form.C23H20F2N10
Mol. Mass.474.4687
SMILESCCCn1cc(cn1)-c1cnc(cc1Nc1cnn(CC(F)F)c1)-c1cnc2cc(cnn12)C#N