Reaction Details
TargetG protein-activated inward rectifier potassium channel 4
LigandBDBM347056
Substrate/Competitorn/a
Meas. Tech.TBD
IC50 8.00±n/a nM
Citation Duncia, JVGardner, DSHynes, JMacor, JENair, SKPaidi, VRSantella, JBSarkunam, KSistla, RKPolimera, SRWu, H Heteroaryl substituted aminopyridine compounds US Patent US10202390 Publication Date 2/12/2019
 
G protein-activated inward rectifier potassium channel 4
Name:G protein-activated inward rectifier potassium channel 4
Type:PROTEIN
Mol. Mass.:47658.06
Organism:Homo sapiens (Human)
Description:ChEMBL_107914
Residue:419
BDBM347056
NameBDBM347056
Synonyms:2-(6-chloropyrazolo[1,5-a]pyrimidin-3-yl)-N-isopropyl-5-(4-propyl-1H-1,2,3-triazol-1-yl)pyridin-4-amine | US10202390, Example 11
TypeSmall organic molecule
Emp. Form.C19H21ClN8
Mol. Mass.396.877
SMILESCCCc1cn(nn1)-c1cnc(cc1NC(C)C)-c1cnn2cc(Cl)cnc12