Reaction Details
TargetD-amino-acid oxidase
LigandBDBM50431069
Substrate/Competitorn/a
Meas. Tech.DAAO Inhibitory Activity Assay
IC50 2.00±n/a nM
Citation Hondo, TNakanishi, KNiimi, TWarizaya, MNamatame, IHarada, K Dihydroxy aromatic heterocyclic compound US Patent US10202399 Publication Date 2/12/2019
 
D-amino-acid oxidase
Name:D-amino-acid oxidase
Type:Homodimer
Mol. Mass.:39476.06
Organism:Homo sapiens (Human)
Description:P14920
Residue:347
BDBM50431069
NameBDBM50431069
Synonyms:CHEMBL2338795 US10463663, Example 7 US9212147, 27 US9931340, Example 7
TypeSmall organic molecule
Emp. Form.C12H11FN2O2
Mol. Mass.234.2263
SMILESOc1cc(CCc2ccccc2F)n[nH]c1=O