Reaction Details
TargetGag-Pol polyprotein
LigandBDBM347150
Substrate/Competitorn/a
Meas. Tech.Anti-HIV Activity
EC50 1.000±n/a nM
Citation Yoshinaga, TNodu, K Polycyclic pyridone derivative having integrase inhibitory activity US Patent US10202404 Publication Date 2/12/2019
 
Gag-Pol polyprotein
Name:Gag-Pol polyprotein
Type:Protein
Mol. Mass.:162074.74
Organism:Human immunodeficiency virus type 1 group M subtype B (isolate HXB2)
Description:P04585
Residue:1435
BDBM347150
NameBDBM347150
Synonyms:US10202404, Compound A-21
TypeSmall organic molecule
Emp. Form.C21H18F2N4O4S
Mol. Mass.460.454
SMILESC[C@@H]1CO[C@H]2Cn3cc(-c4nnc(Cc5ccc(F)cc5F)s4)c(=O)c(O)c3C(=O)N2C1