Reaction Details
TargetGag-Pol polyprotein
LigandBDBM347161
Substrate/Competitorn/a
Meas. Tech.Anti-HIV Activity
EC50 2.50±n/a nM
Citation Yoshinaga, TNodu, K Polycyclic pyridone derivative having integrase inhibitory activity US Patent US10202404 Publication Date 2/12/2019
 
Gag-Pol polyprotein
Name:Gag-Pol polyprotein
Type:Protein
Mol. Mass.:162074.74
Organism:Human immunodeficiency virus type 1 group M subtype B (isolate HXB2)
Description:P04585
Residue:1435
BDBM347161
NameBDBM347161
Synonyms:US10202404, Compound A-33
TypeSmall organic molecule
Emp. Form.C21H18ClFN4O4S
Mol. Mass.476.908
SMILESC[C@@H]1CCO[C@H]2Cn3cc(-c4nnc(Cc5ccc(F)c(Cl)c5)s4)c(=O)c(O)c3C(=O)N12