Reaction Details
TargetGag-Pol polyprotein
LigandBDBM347249
Substrate/Competitorn/a
Meas. Tech.Anti-HIV Activity
EC50 2.40±n/a nM
Citation Yoshinaga, TNodu, K Polycyclic pyridone derivative having integrase inhibitory activity US Patent US10202404 Publication Date 2/12/2019
 
Gag-Pol polyprotein
Name:Gag-Pol polyprotein
Type:Protein
Mol. Mass.:162074.74
Organism:Human immunodeficiency virus type 1 group M subtype B (isolate HXB2)
Description:P04585
Residue:1435
BDBM347249
NameBDBM347249
Synonyms:US10202404, Compound C-24
TypeSmall organic molecule
Emp. Form.C21H17F2N5O3S
Mol. Mass.457.453
SMILESOc1c2C(=O)N3CC4(CC4)CN3Cn2cc(-c2nnc(Cc3ccc(F)cc3F)s2)c1=O