Reaction Details
TargetSomatostatin receptor type 1
LigandBDBM311944
Substrate/Competitorn/a
Meas. Tech.Radioligand Binding Assay
Ki 508±n/a nM
Citation Giovannini, RCui, YDoods, HFerrara, MJust, SKuelzer, RLingard, IMazzaferro, RRudolf, K Somatostatin receptor subtype 4 (SSTR4) agonists US Patent US9789082 Publication Date 10/17/2017
 
Somatostatin receptor type 1
Name:Somatostatin receptor type 1
Type:Enzyme
Mol. Mass.:42692.81
Organism:Homo sapiens (Human)
Description:P30872
Residue:391
BDBM311944
NameBDBM311944
Synonyms:US10166214, Example 80 US9789082, Example 80
TypeSmall organic molecule
Emp. Form.C19H23N3O
Mol. Mass.309.4054
SMILESCc1ncc(c2ccccc12)C(C)(C)NC(=O)[C@@H]1[C@H]2CNC[C@@H]12