Reaction Details
TargetSomatostatin receptor type 4
LigandBDBM311957
Substrate/Competitorn/a
Meas. Tech.Radioligand Binding Assay
Ki 3.60±n/a nM
Citation Giovannini, RCui, YDoods, HFerrara, MJust, SKuelzer, RLingard, IMazzaferro, RRudolf, K Somatostatin receptor subtype 4 (SSTR4) agonists US Patent US9789082 Publication Date 10/17/2017
 
Somatostatin receptor type 4
Name:Somatostatin receptor type 4
Type:Enzyme
Mol. Mass.:42015.38
Organism:Homo sapiens (Human)
Description:P31391
Residue:388
BDBM311957
NameBDBM311957
Synonyms:US10166214, Example 93 US9789082, Example 93
TypeSmall organic molecule
Emp. Form.C17H22N4O
Mol. Mass.298.3828
SMILESCc1cccc2c(n[nH]c12)C(C)(C)NC(=O)[C@@H]1[C@H]2CNC[C@@H]12