Reaction Details
TargetSomatostatin receptor type 4
LigandBDBM311958
Substrate/Competitorn/a
Meas. Tech.Radioligand Binding Assay
Ki 15.9±n/a nM
Citation Giovannini, RCui, YDoods, HFerrara, MJust, SKuelzer, RLingard, IMazzaferro, RRudolf, K Somatostatin receptor subtype 4 (SSTR4) agonists US Patent US9789082 Publication Date 10/17/2017
 
Somatostatin receptor type 4
Name:Somatostatin receptor type 4
Type:Enzyme
Mol. Mass.:42015.38
Organism:Homo sapiens (Human)
Description:P31391
Residue:388
BDBM311958
NameBDBM311958
Synonyms:US10166214, Example 94 US9789082, Example 94
TypeSmall organic molecule
Emp. Form.C16H20N4O
Mol. Mass.284.3562
SMILESCC(C)(NC(=O)[C@@H]1[C@H]2CNC[C@@H]12)c1n[nH]c2ccccc12