Reaction Details
Target15-hydroxyprostaglandin dehydrogenase [NAD(+)]
LigandBDBM347375
Substrate/Competitorn/a
Meas. Tech.In Vitro Assay
IC50 2.61±n/a nM
Citation Markowitz, SWillson, JKPosner, BReady, JAntczak, MZhang, YDesai, AGerson, SGreenlee, W Compositions and methods of modulating short-chain dehydrogenase activity US Patent US9789116 Publication Date 10/17/2017
 
15-hydroxyprostaglandin dehydrogenase [NAD(+)]
Name:15-hydroxyprostaglandin dehydrogenase [NAD(+)]
Type:Enzyme
Mol. Mass.:28974.46
Organism:Homo sapiens (Human)
Description:P15428
Residue:266
BDBM347375
NameBDBM347375
Synonyms:US10301320, ID SW208080 US20230285402, ID # SW208080 | US9789116, SW208080
TypeSmall organic molecule
Emp. Form.C22H22N2OS3
Mol. Mass.426.618
SMILESCCCCCS(=O)c1sc2nc(cc(-c3ccccc3)c2c1N)-c1cccs1