Reaction Details
Target15-hydroxyprostaglandin dehydrogenase [NAD(+)]
LigandBDBM347381
Substrate/Competitorn/a
Meas. Tech.In Vitro Assay
IC50 3.53±n/a nM
Citation Markowitz, SWillson, JKPosner, BReady, JAntczak, MZhang, YDesai, AGerson, SGreenlee, W Compositions and methods of modulating short-chain dehydrogenase activity US Patent US9789116 Publication Date 10/17/2017
 
15-hydroxyprostaglandin dehydrogenase [NAD(+)]
Name:15-hydroxyprostaglandin dehydrogenase [NAD(+)]
Type:Enzyme
Mol. Mass.:28974.46
Organism:Homo sapiens (Human)
Description:P15428
Residue:266
BDBM347381
NameBDBM347381
Synonyms:US10869871, ID # SW208432 US9789116, SW208432
TypeSmall organic molecule
Emp. Form.C17H17NOS2
Mol. Mass.315.453
SMILESCCCCS(=O)c1cc2ccc(nc2s1)-c1ccccc1