Reaction Details
Target15-hydroxyprostaglandin dehydrogenase [NAD(+)]
LigandBDBM347399
Substrate/Competitorn/a
Meas. Tech.In Vitro Assay
IC50 2.65±n/a nM
Citation Markowitz, SWillson, JKPosner, BReady, JAntczak, MZhang, YDesai, AGerson, SGreenlee, W Compositions and methods of modulating short-chain dehydrogenase activity US Patent US9789116 Publication Date 10/17/2017
 
15-hydroxyprostaglandin dehydrogenase [NAD(+)]
Name:15-hydroxyprostaglandin dehydrogenase [NAD(+)]
Type:Enzyme
Mol. Mass.:28974.46
Organism:Homo sapiens (Human)
Description:P15428
Residue:266
BDBM347399
NameBDBM347399
Synonyms:US10869871, ID # SW208777 US9789116, SW208777
TypeSmall organic molecule
Emp. Form.C19H18N4OS3
Mol. Mass.414.567
SMILESCCCCS(=O)c1sc2nc(cc(-c3cccnc3)c2c1N)-c1nccs1