Reaction Details
Target15-hydroxyprostaglandin dehydrogenase [NAD(+)]
LigandBDBM347440
Substrate/Competitorn/a
Meas. Tech.In Vitro Assay
IC50 2.50±n/a nM
Citation Markowitz, SWillson, JKPosner, BReady, JAntczak, MZhang, YDesai, AGerson, SGreenlee, W Compositions and methods of modulating short-chain dehydrogenase activity US Patent US9789116 Publication Date 10/17/2017
 
15-hydroxyprostaglandin dehydrogenase [NAD(+)]
Name:15-hydroxyprostaglandin dehydrogenase [NAD(+)]
Type:Enzyme
Mol. Mass.:28974.46
Organism:Homo sapiens (Human)
Description:P15428
Residue:266
BDBM347440
NameBDBM347440
Synonyms:US10869871, ID # SW209511 US9789116, SW209511
TypeSmall organic molecule
Emp. Form.C23H23N3O3S3
Mol. Mass.485.642
SMILESCCCCS(=O)c1sc2nc(cc(-c3ccc(COC(C)=O)cc3)c2c1N)-c1nccs1