Reaction Details
Target15-hydroxyprostaglandin dehydrogenase [NAD(+)]
LigandBDBM347444
Substrate/Competitorn/a
Meas. Tech.In Vitro Assay
IC50 2.99±n/a nM
Citation Markowitz, SWillson, JKPosner, BReady, JAntczak, MZhang, YDesai, AGerson, SGreenlee, W Compositions and methods of modulating short-chain dehydrogenase activity US Patent US9789116 Publication Date 10/17/2017
 
15-hydroxyprostaglandin dehydrogenase [NAD(+)]
Name:15-hydroxyprostaglandin dehydrogenase [NAD(+)]
Type:Enzyme
Mol. Mass.:28974.46
Organism:Homo sapiens (Human)
Description:P15428
Residue:266
BDBM347444
NameBDBM347444
Synonyms:US10869871, ID # SW212345 US9789116, SW212345
TypeSmall organic molecule
Emp. Form.C21H23N5OS3
Mol. Mass.457.635
SMILESCCCCS(=O)c1sc2nc(cc(-c3cnc(C4CC4)n3C)c2c1N)-c1nccs1