Reaction Details
Target15-hydroxyprostaglandin dehydrogenase [NAD(+)]
LigandBDBM347445
Substrate/Competitorn/a
Meas. Tech.In Vitro Assay
IC50 2.71±n/a nM
Citation Markowitz, SWillson, JKPosner, BReady, JAntczak, MZhang, YDesai, AGerson, SGreenlee, W Compositions and methods of modulating short-chain dehydrogenase activity US Patent US9789116 Publication Date 10/17/2017
 
15-hydroxyprostaglandin dehydrogenase [NAD(+)]
Name:15-hydroxyprostaglandin dehydrogenase [NAD(+)]
Type:Enzyme
Mol. Mass.:28974.46
Organism:Homo sapiens (Human)
Description:P15428
Residue:266
BDBM347445
NameBDBM347445
Synonyms:US10869871, ID # SW212363 US9789116, SW212363
TypeSmall organic molecule
Emp. Form.C22H21N3O4S3
Mol. Mass.487.615
SMILESCCCCS(=O)c1sc2nc(cc(-c3ccc(OCC(O)=O)cc3)c2c1N)-c1nccs1