Reaction Details
TargetHistone deacetylase 4
LigandBDBM347454
Substrate/Competitorn/a
Meas. Tech.Inhibition Assay
Ki 59.0±n/a nM
Citation Wright, DLAnderson, ACVan Heyst, MOnonye, S Substituted tropolone derivatives and methods of use US Patent US9790158 Publication Date 10/17/2017
 
Histone deacetylase 4
Name:Histone deacetylase 4
Type:Enzyme
Mol. Mass.:119049.39
Organism:Homo sapiens (Human)
Description:P56524
Residue:1084
BDBM347454
NameBDBM347454
Synonyms:MO-OH-TM | US9790158, 5
TypeSmall organic molecule
Emp. Form.C16H16O5
Mol. Mass.288.2952
SMILESCOc1ccc(c(OC)c1OC)-c1ccccc(O)c1=O