Reaction Details
TargetHistone deacetylase 8
LigandBDBM347457
Substrate/Competitorn/a
Meas. Tech.Inhibition Assay
Ki 1.42±n/a nM
Citation Wright, DLAnderson, ACVan Heyst, MOnonye, S Substituted tropolone derivatives and methods of use US Patent US9790158 Publication Date 10/17/2017
 
Histone deacetylase 8
Name:Histone deacetylase 8
Type:Enzyme
Mol. Mass.:41749.60
Organism:Homo sapiens (Human)
Description:Q9BY41
Residue:377
BDBM347457
NameBDBM347457
Synonyms:US9790158, 8
TypeSmall organic molecule
Emp. Form.C15H14O4
Mol. Mass.258.2693
SMILESCOc1ccc(OC)c(c1)-c1cccc(O)c(=O)c1