Reaction Details
TargetHistone deacetylase 8
LigandBDBM79632
Substrate/Competitorn/a
Meas. Tech.Inhibition Assay
Ki 105±n/a nM
Citation Wright, DLAnderson, ACVan Heyst, MOnonye, S Substituted tropolone derivatives and methods of use US Patent US9790158 Publication Date 10/17/2017
 
Histone deacetylase 8
Name:Histone deacetylase 8
Type:Enzyme
Mol. Mass.:41749.60
Organism:Homo sapiens (Human)
Description:Q9BY41
Residue:377
BDBM79632
NameBDBM79632
Synonyms:2-hydroxy-6-isopropyl-cyclohepta-2,4,6-trien-1-one 2-hydroxy-6-propan-2-ylcyclohepta-2,4,6-trien-1-one MLS001048906 US9790158, 9 | cid_3611
TypeSmall organic molecule
Emp. Form.C10H12O2
Mol. Mass.164.2011
SMILESCC(C)c1cccc(O)c(=O)c1